{"text_format":"1","workbook":"xlsx","n_sheets":12,"sheets":["Summary","Functional (JB rework)","Functional old","Sheet3","Technical evaluation","Integration and Testing","Functional","Cloud","Demonstration","Priority Ratings","Config","Concerns and Recommendations"],"not_rendered":{"charts":0,"images":2,"macros":1,"external_links":1,"defined_names":27,"comments":0,"pivot_tables":0},"unopened":[],"bounds":{"document_bytes":16777216,"sheet_cells":100000,"rows_first":2000,"rows_last":500,"rows_between":2000,"halvings":0,"cell_chars":16384,"cell_head_chars":4096},"cells_cut":0,"cells_raw":0,"read":"whole","date_system":"1900"}

{"sheet":"Summary","index":0,"n_rows":46,"n_cols":6,"rows_kept":46,"cut":false,"hidden":false,"merged":[[11,0,11,3],[20,0,20,4],[21,0,21,4],[19,0,19,4],[12,0,12,3],[17,0,17,5],[18,0,18,4],[13,0,13,3],[14,0,14,3],[10,0,10,3],[3,1,3,3],[3,4,3,11],[5,0,5,3],[6,0,6,3],[7,0,7,3],[8,0,8,3],[9,0,9,3],[0,0,0,3],[0,4,0,13],[1,1,1,3],[1,4,1,13],[2,1,2,3],[2,4,2,13],[23,0,23,5],[24,0,24,5],[25,0,25,5],[26,0,26,5],[27,0,27,5],[29,1,29,2],[29,5,30,5],[30,0,33,0],[30,4,33,4],[34,0,34,1]]}
["Workflow specific - Intelligent Business Process Management Tool"]
["Tender Number:"]
["Tenderer:"]
["Evaluated by:"]
[]
["Important Notes: "]
["1. Please indicate location of answers to the criteria and where required answer yes or no. To be included in Comments tab per sheet."]
["2. The qualified solution service provider shall do a product demo of the proposed product to be presented to Eskom.  This is mandatory. "]
["3. \"Tenderer(s) to take note of the following key instructions - Please follow the structure of the technical evaluation sheet provided when responding to this enquiry."]
["4.  DO NOT just give YES/NO kind of response to the questions which require more details and information."]
{"$rows_left_out":37}
{"sheet":"Functional (JB rework)","index":1,"n_rows":57,"n_cols":4,"rows_kept":57,"cut":false,"hidden":true,"merged":[]}
["#","Requirement Group","Requirement","Priority Description"]
[1,"Source data repository","Source data repository:\n- Provide a managed data repository for electricity sales forecasting related datasets.\ne.g. \n- Billing system - electricity sales and bills\n- Metering data aquistion system - interval reads\n- Finance system (SAP) - electricity sales (official income statement level electricity sales)\netc.\n\n- Aside: Source data not to be changed by the forecasting system.\n- Aside: Source data required should cover at least a 10 to 15 years of historical data"]
[2,"Source data repository","Source data repository - migrate historical data:\n- Ability to migrate data from the existing data warehouse, containing sales and forecasting datasets, into a new sales and forecasting source data repository.\n\nNote:\n- Eskom has an existing data warehouse used by the current forecasting system. "]
[3,"Source data repository","Source data repository - source / obtain current data:\n- Ability to provide automated bulk acquisition (via data pipelines etc.) of current sales and forecasting datasets from source systems to store in the new sales and forecasting source data repository."]
[4,"Source data repository","Source data repository - access:\n- Provide access to other users who need sales and forecasting related analystics i.e. no access to the forecasting system, but access to use reporting and data analytics."]
[5,"Electricity sales forecast","Electricity sales forecast - predictive analysis:\n- Abiltity to generate electricity sales forecasts based on historical actual data."]
[6,"Electricity sales forecast","Electricity sales forecast - adjustments:\n- Ability to apply adjust electricity sales forecasts by a factor or algorithm. For example: Adjust forecast for mining in a particular region by 10%.\n- Adjustments to be applied to any subset of data / dimension determined by the business."]
[7,"Electricity sales forecast","Electricity sales forecast - retention:\n- Ability to store previous electricity sales forecasts.\n- Provide audit trail e.g. when generated, by whom etc."]
[8,"Electricity sales forecast","Electricity sales forecast - rolling window:\n- Ability to draw on previous forecasts (based on actual historical data or forecasters inputs) e.g. drop years not applicable and add the years."]
[9,"Electricity sales forecast","Electricity sales forecast - multivariate analysis:\n- Abiltity to apply multivariate forecasting algorithms, allowing users to adjust the factors that influence electricity sales projections."]
{"$rows_left_out":48}
{"sheet":"Functional old","index":2,"n_rows":89,"n_cols":13,"rows_kept":89,"cut":false,"hidden":true,"merged":[[87,0,87,12],[6,10,6,12],[2,0,2,1],[3,0,3,1],[5,0,5,2],[6,8,6,9]]}
["Sales and Forecasting Tracking Tool",null,null," ",null," "]
["Tender Number:",null," MWP1173CX\t"," ",null," "]
["Tenderer:",null," "," ",null," "]
["Evaluated by:",null," "," ",null," "]
[]
["Evaluation Criteria",null,null," ",null," "]
[null,null," "," "," "," ",null," ","Weight\n(agreed by evaluation team members)",null,"Score\n(determined by each evaluation team member during evaluation. Will be averaged for final scores)"]
["ID","Type","Criterion","Solution","Functional Requirement","Requirement description","Comments","Priority Description","Priority","Weighted Question","Scoring","Answer\n(0,50,100%)","Weighted Answer"]
["BRS1","Meeting the Scope of Work Required","The tool should be able to generate forecast summaries/reports that can spot issues like missing or outdated data ad fill gaps to improve accuracy across the board ","Sales and revenue tracking tool","Core Features","Does it have this requirement? Explain how this requirement is realised"," ","Very important",4,{"$error":"#DIV/0!"},"100%: Fully comply with requirement\n50%:   Partially comply will require development/ customisation\n0%:     No compliance"," ",{"$error":"#DIV/0!"}]
["BRS2","Meeting the Scope of Work Required","A revenue calculator that can calculate revenue based on price changes","Sales and revenue tracking tool","Core Features","Does it have this requirement? Explain how this requirement is realised"," ","Very important",4,{"$error":"#DIV/0!"},"100%: Fully comply with requirement\n50%:   Partially comply will require development/ customisation\n0%:     No compliance"," ",{"$error":"#DIV/0!"}]
{"$rows_left_out":80}
{"sheet":"Sheet3","index":3,"n_rows":9,"n_cols":5,"rows_kept":9,"cut":false,"hidden":true,"merged":[]}
[]
[]
[]
[null,null,null,null,"Test"]
[null,null,null,null,1]
[null,null,null,null,2]
[null,null,null,null,3]
[null,null,null,null,4]
[null,null,null,null,5]

{"sheet":"Technical evaluation","index":4,"n_rows":24,"n_cols":13,"rows_kept":24,"cut":false,"hidden":false,"merged":[[6,10,6,12],[6,8,6,9],[0,0,0,3],[1,0,1,1],[2,0,2,1],[3,0,3,1],[5,0,5,3]]}
["Workflow specific - Intelligent Business Process Management Tool"]
["Tender Number:"]
["Tenderer:"]
["Evaluated by:"]
[]
["Evaluation Criteria"]
[null,null,null,null,null,null,null,null,"Weight\n(agreed by evaluation team members)",null,"Score\n(determined by each evaluation team member during evaluation. Will be averaged for final scores)"]
["ID","Type","Solution","Criterion","Functional Requirement","Requirement description","Comments","Priority Description","Priority\n","Weighted Question","Scoring","Answer\n(0,50,100%)","Weighted Answer"]
[1,"Meeting the Scope of Work Required","Workflow specific - Intelligent Business Process Management Tool","Compatibility Certificate from Microsoft AD or Azure","Information Security","Access Control and User Account Management (Technical Support Team)\n\nIs your Proposed Solution comply and Compatible with Microsoft Active Directory and or Azure",null,"Very important",{"$f":"IF(H9='Priority Ratings'!$C$21,'Priority Ratings'!$B$21,IF(H9='Priority Ratings'!$C$22,'Priority Ratings'!$B$22,IF(H9='Priority Ratings'!$C$23,'Priority Ratings'!$B$23,IF(H9='Priority Ratings'!$C$24,'Priority Ratings'!$B$24,IF(H9='Priority Ratings'!$C$25,'Priority Ratings'!$B$25,IF(H9='Priority Ratings'!$C$26,'Priority Ratings'!$B$26,IF(H9='Priority Ratings'!$C$27,'Priority Ratings'!$B$27,\"No Rating\")))))))","v":4},{"$f":"I9/I24","v":7.2727272727272724E-2},"100%: Fully comply with requirement\n50%:   Partially comply will require development/ customisation\n0%:     No compliance",0,{"$f":"J9*L9","v":0}]
[2,"Meeting the Scope of Work Required","Workflow specific - Intelligent Business Process Management Tool","Certificate from the OEM or Reputable Authority ","Information Security","Information Security Threat Management \n\nPlease advise to what extend is your Solution Compatible \n1. Malware\n2. Cyber Attack\n3. Anti-Virus\n",null,"Very important",{"$f":"IF(H10='Priority Ratings'!$C$21,'Priority Ratings'!$B$21,IF(H10='Priority Ratings'!$C$22,'Priority Ratings'!$B$22,IF(H10='Priority Ratings'!$C$23,'Priority Ratings'!$B$23,IF(H10='Priority Ratings'!$C$24,'Priority Ratings'!$B$24,IF(H10='Priority Ratings'!$C$25,'Priority Ratings'!$B$25,IF(H10='Priority Ratings'!$C$26,'Priority Ratings'!$B$26,IF(H10='Priority Ratings'!$C$27,'Priority Ratings'!$B$27,\"No Rating\")))))))","v":4},{"$f":"I10/I24","v":7.2727272727272724E-2},"100%: Fully comply with requirement\n50%:   Partially comply will require development/ customisation\n0%:     No compliance",0,0]
{"$rows_left_out":15}
{"sheet":"Integration and Testing","index":5,"n_rows":32,"n_cols":14,"rows_kept":32,"cut":false,"hidden":false,"merged":[[6,11,6,13],[0,0,0,3],[1,0,1,1],[2,0,2,1],[3,0,3,1],[5,0,5,3],[6,9,6,10]]}
[{"$f":"'Technical evaluation'!A1","v":"Workflow specific - Intelligent Business Process Management Tool"}]
["Tender Number:"]
["Tenderer:"]
["Evaluated by:"]
[]
["Evaluation Criteria"]
[null,null,null,null,null,null,null,null,null,"Weight\n(agreed by evaluation team members)",null,"Score\n(determined by each evaluation team member during evaluation. Will be averaged for final scores)"]
["ID","Type","Category","Criterion","Solution","Functional Requirement","Requirement description","Comments","Priority Description","Priority\n","Weighted Question","Scoring","Answer\n(0,50,100%)","Weighted Answer"]
[1,"Team Organisation and Member Requirements","Non Functional","Previous involvement in the end to end testing of a similar system and methodologies used)","Workflow specific - Intelligent Business Process Management Tool","Testing ","Provide reference customers and sites",null,"Very important",{"$f":"IF(I9='Priority Ratings'!$C$21,'Priority Ratings'!$B$21,IF(I9='Priority Ratings'!$C$22,'Priority Ratings'!$B$22,IF(I9='Priority Ratings'!$C$23,'Priority Ratings'!$B$23,IF(I9='Priority Ratings'!$C$24,'Priority Ratings'!$B$24,IF(I9='Priority Ratings'!$C$25,'Priority Ratings'!$B$25,IF(I9='Priority Ratings'!$C$26,'Priority Ratings'!$B$26,IF(I9='Priority Ratings'!$C$27,'Priority Ratings'!$B$27,\"No Rating\")))))))","v":4},{"$f":"J9/J$32","v":4.2553191489361701E-2},"100%: Fully comply with requirement\n50%:   Partially comply(Have experience but not a similar system)\n0%:     No experience",0,{"$f":"K9*M9","v":0}]
[2,"Team Organisation and Member Requirements","Non Functional","Resource model. It is a requirement that sufficient dedicated testers are allocated the project, independent of the development team. Team members have the required ISTQB testing certifications (Provide Certifications of team members)","Workflow specific - Intelligent Business Process Management Tool","Testing ","Experienced Test Manger must be provided",null,"Very important",{"$f":"IF(I10='Priority Ratings'!$C$21,'Priority Ratings'!$B$21,IF(I10='Priority Ratings'!$C$22,'Priority Ratings'!$B$22,IF(I10='Priority Ratings'!$C$23,'Priority Ratings'!$B$23,IF(I10='Priority Ratings'!$C$24,'Priority Ratings'!$B$24,IF(I10='Priority Ratings'!$C$25,'Priority Ratings'!$B$25,IF(I10='Priority Ratings'!$C$26,'Priority Ratings'!$B$26,IF(I10='Priority Ratings'!$C$27,'Priority Ratings'!$B$27,\"No Rating\")))))))","v":4},{"$f":"J10/J$32","v":4.2553191489361701E-2},"100%: > 5 years experienced Testmanager provided\n50%: between 2 and 5 years exeperience\n0%: < 2 yearsexperience",0,{"$f":"K10*M10","v":0}]
{"$rows_left_out":23}
{"sheet":"Functional","index":6,"n_rows":75,"n_cols":15,"rows_kept":75,"cut":false,"hidden":false,"merged":[[73,0,73,14],[2,0,2,1],[3,0,3,1],[5,0,5,2],[6,10,6,11],[6,12,6,14]]}
["Workflow specific - Intelligent Business Process Management Tool",null,null," ",null,null,null," "]
["Tender Number:",null,null," ",null,null,null," "]
["Tenderer:",null," "," ",null,null,null," "]
["Evaluated by:",null," "," ",null,null,null," "]
[]
["Evaluation Criteria",null,null," ",null,null,null," "]
[null,null," "," ",null," ",null," ",null," ","Weight\n(agreed by evaluation team members)",null,"Answer\n(0,50,100%)"]
["ID","Type","Solution","Functional Requirement","BRS ref","Criterion","Requirement description","Comments","Priority Description","Priority","Weighted Question","Scoring","Answer\n(0,50,100%)","Weighted Answer"]
[1,"Meeting the Scope of Work Required","Workflow specific - Intelligent Business Process Management Tool","Forms and Rules","Addendum 2\n7.1.2\n\n\n\n\n\n\n\nDFR9","Capability to provide and to easily use drag and drop forms","Discuss your solution's ability to meet this requirement. Please provide applicable evidence (solution features and functionality, experience, reference or certification etc.)."," ","Very important",{"$f":"IF(I9='[1]Priority Ratings'!$C$21,'[1]Priority Ratings'!$B$21,IF(I9='[1]Priority Ratings'!$C$22,'[1]Priority Ratings'!$B$22,IF(I9='[1]Priority Ratings'!$C$23,'[1]Priority Ratings'!$B$23,IF(I9='[1]Priority Ratings'!$C$24,'[1]Priority Ratings'!$B$24,IF(I9='[1]Priority Ratings'!$C$25,'[1]Priority Ratings'!$B$25,IF(I9='[1]Priority Ratings'!$C$26,'[1]Priority Ratings'!$B$26,IF(I9='[1]Priority Ratings'!$C$27,'[1]Priority Ratings'!$B$27,\"No Rating\")))))))","v":4},{"$f":"J9/J75","v":1.646090534979424E-2},"100%: Fully comply with requirement\n50%:   Partially comply will require development/ customisation\n0%:     No compliance",0,{"$f":"K9*M9","v":0}]
[2,"Meeting the Scope of Work Required","Workflow specific - Intelligent Business Process Management Tool","Forms and Rules","Addendum 2","Capability to design forms","Discuss your ability to meet this requirement. Please provide applicable evidence (tools and methods, experience, reference or certification etc.)."," ","Very important",{"$f":"IF(I10='[1]Priority Ratings'!$C$21,'[1]Priority Ratings'!$B$21,IF(I10='[1]Priority Ratings'!$C$22,'[1]Priority Ratings'!$B$22,IF(I10='[1]Priority Ratings'!$C$23,'[1]Priority Ratings'!$B$23,IF(I10='[1]Priority Ratings'!$C$24,'[1]Priority Ratings'!$B$24,IF(I10='[1]Priority Ratings'!$C$25,'[1]Priority Ratings'!$B$25,IF(I10='[1]Priority Ratings'!$C$26,'[1]Priority Ratings'!$B$26,IF(I10='[1]Priority Ratings'!$C$27,'[1]Priority Ratings'!$B$27,\"No Rating\")))))))","v":4},{"$f":"J10/J75","v":1.646090534979424E-2},"100%: Fully comply with requirement\n50%:   Partially comply will require development/ customisation\n0%:     No compliance",0,{"$f":"K10*M10","v":0}]
{"$rows_left_out":66}
{"sheet":"Cloud","index":7,"n_rows":19,"n_cols":13,"rows_kept":19,"cut":false,"hidden":false,"merged":[[6,10,6,12],[17,0,17,12],[0,0,0,3],[1,0,1,1],[2,0,2,1],[3,0,3,1],[5,0,5,3],[6,8,6,9]]}
[{"$f":"'Technical evaluation'!A1","v":"Workflow specific - Intelligent Business Process Management Tool"}]
["Tender Number:"]
["Tenderer:"]
["Evaluated by:"]
[]
["Evaluation Criteria"]
[null,null,null,null,null,null,null,null,"Weight\n(agreed by evaluation team members)",null,"Score\n(determined by each evaluation team member during evaluation. Will be averaged for final scores)"]
["ID","Type","Solution","Criterion","Functional Requirement","Requirement description","Comments","Priority Description","Priority\n","Weighted Question","Scoring","Answer\n(0,50,100%)","Weighted Answer"]
[1,"Meeting the Scope of Work Required","Workflow specific - Intelligent Business Process Management Tool","Please clearly state the envisaged start date of the agreement (i.e. commencement of services and service levels).","• Support of cloud\nStandAlone or cloud solution","Any gap between service implementation and “go-live” must be clearly identified. \nIndicate costs in stabilisation period vs production period (operational transactions). Calrify when the solution will be operational.\nIndicate resources to remain to ensure stabilisation\nHow do you conform to the SLA we are proposing. ",null,"Very important",{"$f":"IF(H9='Priority Ratings'!$C$21,'Priority Ratings'!$B$21,IF(H9='Priority Ratings'!$C$22,'Priority Ratings'!$B$22,IF(H9='Priority Ratings'!$C$23,'Priority Ratings'!$B$23,IF(H9='Priority Ratings'!$C$24,'Priority Ratings'!$B$24,IF(H9='Priority Ratings'!$C$25,'Priority Ratings'!$B$25,IF(H9='Priority Ratings'!$C$26,'Priority Ratings'!$B$26,IF(H9='Priority Ratings'!$C$27,'Priority Ratings'!$B$27,\"No Rating\")))))))","v":4},{"$f":"I9/I$19","v":0.12121212121212122},"100%: Fully comply with requirement\n50%:   Partially comply will require development/ customisation\n0%:     No compliance",null,{"$f":"J9*L9","v":0}]
[2,"Meeting the Scope of Work Required","Workflow specific - Intelligent Business Process Management Tool","Does the Supplier’s compliance with copyright laws and other applicable intellectual property rights restrict the type of content ESKOM can store with the cloud service?","DATA OWNERSHIP AND USE",null,null,"Very important",{"$f":"IF(H10='Priority Ratings'!$C$21,'Priority Ratings'!$B$21,IF(H10='Priority Ratings'!$C$22,'Priority Ratings'!$B$22,IF(H10='Priority Ratings'!$C$23,'Priority Ratings'!$B$23,IF(H10='Priority Ratings'!$C$24,'Priority Ratings'!$B$24,IF(H10='Priority Ratings'!$C$25,'Priority Ratings'!$B$25,IF(H10='Priority Ratings'!$C$26,'Priority Ratings'!$B$26,IF(H10='Priority Ratings'!$C$27,'Priority Ratings'!$B$27,\"No Rating\")))))))","v":4},0.12121212121212122,"100%: Fully comply with requirement\n50%:   Partially comply will require development/ customisation\n0%:     No compliance",null,0]
{"$rows_left_out":10}
{"sheet":"Demonstration","index":8,"n_rows":45,"n_cols":14,"rows_kept":45,"cut":false,"hidden":false,"merged":[[6,11,6,13],[43,0,43,13],[0,0,0,2],[1,0,1,1],[2,0,2,1],[3,0,3,1],[5,0,5,2],[6,9,6,10]]}
[{"$f":"'Technical evaluation'!A1","v":"Workflow specific - Intelligent Business Process Management Tool"}]
["Tender Number:"]
["Tenderer:"]
["Evaluated by:"]
[]
["Evaluation Criteria"]
[null,null,null,null,null,null,null,null,null,"Weight\n(agreed by evaluation team members)",null,"Score\n(determined by each evaluation team member during evaluation. Will be averaged for final scores)"]
["ID","Type","Criterion","Solution","Category","Functional Requirement","Requirement description","Comments","Priority Description","Priority\n","Weighted Question","Scoring","Answer\n(0,50,100%)","Weighted Answer"]
[1,"Meeting the Scope of Work Required","The tool should be able to generate forecast summaries/reports that can spot issues like missing or outdated data ad fill gaps to improve accuracy across the board ","Workflow specific - Intelligent Business Process Management Tool","Functional","Core Features","Does it have this requirement? Show how this requirement is realised",null,"Very important",{"$f":"IF(I9='Priority Ratings'!$C$21,'Priority Ratings'!$B$21,IF(I9='Priority Ratings'!$C$22,'Priority Ratings'!$B$22,IF(I9='Priority Ratings'!$C$23,'Priority Ratings'!$B$23,IF(I9='Priority Ratings'!$C$24,'Priority Ratings'!$B$24,IF(I9='Priority Ratings'!$C$25,'Priority Ratings'!$B$25,IF(I9='Priority Ratings'!$C$26,'Priority Ratings'!$B$26,IF(I9='Priority Ratings'!$C$27,'Priority Ratings'!$B$27,\"No Rating\")))))))","v":4},{"$f":"J9/J$45","v":2.7027027027027029E-2},"100%: Fully comply with requirement\n50%:   Partially comply will require development/ customisation\n0%:     No compliance",0,{"$f":"K9*M9","v":0}]
[2,"Meeting the Scope of Work Required","A revenue calculator that can calculate revenue based on price changes","Workflow specific - Intelligent Business Process Management Tool","Functional","Core Features","Does it have this requirement? Show how this requirement is realised",null,"Critical",{"$f":"IF(I10='Priority Ratings'!$C$21,'Priority Ratings'!$B$21,IF(I10='Priority Ratings'!$C$22,'Priority Ratings'!$B$22,IF(I10='Priority Ratings'!$C$23,'Priority Ratings'!$B$23,IF(I10='Priority Ratings'!$C$24,'Priority Ratings'!$B$24,IF(I10='Priority Ratings'!$C$25,'Priority Ratings'!$B$25,IF(I10='Priority Ratings'!$C$26,'Priority Ratings'!$B$26,IF(I10='Priority Ratings'!$C$27,'Priority Ratings'!$B$27,\"No Rating\")))))))","v":5},3.3783783783783786E-2,"100%: Fully comply with requirement\n50%:   Partially comply will require development/ customisation\n0%:     No compliance",0,0]
{"$rows_left_out":36}
{"sheet":"Priority Ratings","index":9,"n_rows":27,"n_cols":6,"rows_kept":27,"cut":false,"hidden":false,"merged":[]}
[]
[]
[]
[]
[]
[]
[]
[]
[]
[]
{"$rows_left_out":18}
{"sheet":"Config","index":10,"n_rows":9,"n_cols":7,"rows_kept":9,"cut":false,"hidden":true,"merged":[]}
[]
[null,"Solution",null,"Priority rating","Priority Description",null,"Category"]
[null,"Chatbot",null,0,"No interest",null,"Functional"]
[null,"Social Media API",null,1,"Nice to have",null,"Technical Evaluation"]
[null,"Chatbot and Social Media API",null,2,"Useful",null,"Integration and Testing"]
[null,null,null,3,"Important",null,"Cloud"]
[null,null,null,4,"Very important"]
[null,null,null,5,"Critical"]
[null,null,null,6,"Show stopper"]

{"sheet":"Concerns and Recommendations","index":11,"n_rows":19,"n_cols":2,"rows_kept":19,"cut":false,"hidden":true,"merged":[[2,1,2,2],[3,1,16,14],[18,1,18,2],[19,1,33,14]]}
["Note: Not applicable for the vendors / Tenderers / respondents. This sheet is not needed for issuing the Tendor. Useful for making recommendatins after evaluation."]
[]
[null,"Recommendation"]
[]
[]
[]
[]
[]
[]
[]
{"$rows_left_out":9}